{"text_format":"3","workbook":"xlsx","n_sheets":2,"sheets":["报名记录模板","Sheet1"],"not_rendered":{"external_links":1,"defined_names":3},"read":"whole","date_system":"1900"}

{"sheet":"报名记录模板","index":0,"n_rows":145,"n_cols":27,"rows_kept":145,"hidden":true,"merged":[[0,0,0,26],[1,0,1,26]]}
["报名记录","","","","","","","","","","","","","","","","","","","","","","","","","",""]
["制表时间：2022年06月30日","","","","","","","","","","","","","","","","","","","","","","","","","",""]
["姓名","应聘岗位","性别","证件号码","政治面貌","出生日期","手机号码","紧急联系人电话","籍贯","婚姻状态","入党时间","户籍地址(身份证)","通讯地址(现居地)","最高学历","是否服兵役","服兵役期限","所在部队","是否在职","单位名称","岗位相关资格证书及等级","是否有驾照","驾龄","岗位相关资格","第一学历（全日制）","学习经历(从高中写起)","工作经历","家庭成员情况"]
["刘元志","窗口登记辅助人员-综合岗","男","370284199210283356","群众","1992-10-28","15192011028","15253223799","山东省青岛市黄岛区","未婚","","山东省青岛市黄岛区大场镇湾东村","山东省青岛市黄岛区公园路57号环城小区","本科","否","","","否","","","是","请输入驾龄","","1、学历：本科，  学校：济南大学泉城学院商学院，  专业：经济学，  毕业时间：2022-06-30;  ","","","1、姓名：刘发勋，   联系方式：18300523678，  关系：父子，  用工单位：;   2、姓名：丁翠堂，   联系方式：15253223799，  关系：母子，  用工单位：;   3、姓名：刘凌轩，   联系方式：15253223799，  关系：兄妹，  用工单位：;   "]
["郭琳","窗口登记辅助人员-文秘岗","女","370211200004040027","群众","2000-04-04","13655327129","18766226077","山东省青岛市","未婚","","370211200004040027","山东省青岛市黄岛区中南漫悦湾","本科","否","","","否","","","是","2年","","1、学历：本科，  学校：山东师范大学历山学院艺术学院，  专业：视觉传达设计专业，  毕业时间：2022-06-22;  ","","","1、姓名：于令杰，   联系方式：13675326679，  关系：母亲，  用工单位：;   "]
["桑田","窗口登记辅助人员-综合岗","女","230422198901181929","群众","1989-01-18","18678935602","15650165127","山东","已婚","","黑龙江省鹤岗市","山东省青岛市黄岛区隐珠街道金晖路星河城四期","本科","否","","","否","","","是","6","","1、学历：本科，  学校：哈尔滨师范大学恒星学院，  专业：对外汉语，  毕业时间：2011-06-26;  ","","","1、姓名：张丙强，   联系方式：15650165127，  关系：配偶，  用工单位：融合控股集团;   2、姓名：张子涵，   联系方式：18678935602，  关系：子女，  用工单位：稚善幼儿园;   "]
["李婷婷","窗口登记辅助人员-综合岗","女","370281199207182627","党员","1992-07-18","15020053606","17669686583","山东胶州","已婚","2015-12-01","山东青岛胶州市李哥庄镇小辛疃村","黄岛区漓江东路金泽儒家小区","本科","否","","","是","青岛海达贤泽人力资源开发有限公司劳动派遣至崂山区市场监督管理局","","是","请输入驾龄","","1、学历：本科，  学校：厦门大学外文学院，  专业：日语，  毕业时间：2016-07-01;  ","1、学历：高中，  学校：胶州一中，  专业：文科，  毕业时间：2011-06-30;  2、学历：本科，  学校：厦门大学外文学院，  专业：日语，  毕业时间：2016-07-01;  ","1、用工单位：青岛海达贤泽人力资源开发有限公司劳动派遣至崂山区市场局，  职业：辅助人员，  起止时间：2017-09-25至2022-06-29;  ","1、姓名：徐文刚，   联系方式：13792490927，  关系：丈夫，  用工单位：中国石油大学（华东）;   2、姓名：李林结，   联系方式：13070835763，  关系：父亲，  用工单位：青岛林源塑料制品有限公司;   3、姓名：贾惠香，   联系方式：15553229568，  关系：母亲，  用工单位：青岛林源塑料制品有限公司;   4、姓名：李向东，   联系方式：15553229568，  关系：弟弟，  用工单位：淄博职业学院;   "]
["郭立鸽","窗口登记辅助人员-综合岗","男","142729198801126018","党员","1988-01-12","15908982610","18906428620","山西运城","已婚","2011-07-01","山东省青岛市市南区延安三路101号","山东省青岛市黄岛区灵山卫街道凭海临风小区31号楼","本科","否","","","是","上海医药集团青岛国风药业股份有限公司","","是","五年","","1、学历：本科，  学校：山东中医药大学，  专业：制药工程，  毕业时间：2012-07-01;  ","","","1、姓名：马丽君，   联系方式：18005428620，  关系：配偶，  用工单位：西海岸新区第三人民医院;   2、姓名：郭伊洛，   联系方式：18906428620，  关系：父女，  用工单位：红黄蓝幼儿园;   "]
["刘淑娟","窗口登记辅助人员-综合岗","女","222403198710114820","群众","1987-10-11","19153223304","15063016687","吉林省","已婚","","吉林省敦化市秋梨沟镇","青岛市西海岸新区书香泮城三期","大专","否","","","否","","","是","无","","1、学历：大专，  学校：青岛广播电视大学，  专业：学前教育，  毕业时间：2022-07-31;  ","","1、用工单位：金色风车幼儿园，  职业：保育老师，  起止时间：2022-06-30至2022-06-30;  ","1、姓名：赵庆臣，   联系方式：15063016687，  关系：配偶，  用工单位：青岛瑞源万泰建筑工程有限公司;   "]
["刘慧","窗口登记辅助人员-综合岗","女","370284199310135326","其他","1993-10-13","18661812750","13808977986","山东省青岛市黄岛区宝山镇雷家庄村","未婚","","山东省青岛市黄岛区宝山镇雷家庄村","黄岛区两河路帝邦帝城","本科","否","","","否","","","是","请输入驾龄6年","","1、学历：本科，  学校：山东理工大学，商学院，  专业：国际经济与贸易，  毕业时间：2016-06-20;  ","1、学历：本科，  学校：山东理工大学，商学院，  专业：国际经济与贸易，  毕业时间：2016-06-25;  2、学历：高中，  学校：青岛西海岸实验高级中学，  专业：高中，  毕业时间：2012-06-12;  ","1、用工单位：青岛凡思领航教育科技有限公司，  职业：运营经理，  起止时间：2018-03-12至2020-02-28;  2、用工单位：青岛卓越创新教育科技集团，  职业：教育服务事业部负责人，总经理助理，  起止时间：2020-05-20至2021-03-01;  3、用工单位：环球市场集团，  职业：跨境电商合伙人，  起止时间：2016-08-10至2017-11-30;  ","1、姓名：王之凤，   联系方式：13475857226，  关系：母亲，  用工单位：青岛市黄岛区宝山镇;   2、姓名：刘之进，   联系方式：13475857226，  关系：父亲，  用工单位：青岛市黄岛区宝山镇;   3、姓名：刘杰，   联系方式：13808977986，  关系：姐姐，  用工单位：青岛北斗星电力设备有限公司;   "]
["尹文龙","窗口登记辅助人员-综合岗","男","370786198807032416","群众","1988-07-02","13675326829","18816391802","山东省昌邑市","已婚","","山东省青岛市黄岛区长江中路附1号2608户","山东省青岛市黄岛区珠江路91号1号楼701户","本科","否","","","否","","","否","请输入驾龄","","1、学历：本科，  学校：中国石油大学(华东)石油工程学院，  专业：船舶与海洋工程，  毕业时间：2011-06-30;  ","","","1、姓名：尹春浦，   联系方式：18816391802，  关系：父亲，  用工单位：;   "]
["于海蓝","窗口登记辅助人员-文秘岗","女","370323199605310446","预备党员","1996-05-31","17805422658","134 6828 0770","山东淄博","未婚","2021-10-29","山东省青岛市黄岛区长江路街道","青岛市黄岛区五龙河路芙蓉苑小区","本科","否","","","是","青岛真情巴士集团有限公司","","是","请输入驾龄1年","","1、学历：本科，  学校：山东科技大学文法学院，  专业：汉语言文学，  毕业时间：2019-06-19;  ","1、学历：本科，  学校：山东科技大学文法学院，  专业：汉语言文学，  毕业时间：2019-06-19;  ","","1、姓名：于朝兵，   联系方式：17805422658，  关系：父亲，  用工单位：退休;   2、姓名：周士美，   联系方式：17805422658，  关系：母亲，  用工单位：退休;   "]
["冯丽","窗口登记辅助人员-文秘岗","女","370284199212230821","党员","1992-12-23","15969805233","18561909378","山东省黄岛区大荒庄","已婚","","山东省胶南市隐珠街道办事处大荒庄86号","山东省九方海悦华庭","本科","否","","","否","","","是","请输入驾龄","","1、学历：本科，  学校：济宁学院，  专业：文化产业管理，  毕业时间：2022-06-30;  ","","","1、姓名：赵海青，   联系方式：13963900918，  关系：婆媳，  用工单位：望景装饰工程有限公司;   2、姓名：臧嘉南，   联系方式：18561909378，  关系：夫妻，  用工单位：;   3、姓名：臧杰，   联系方式：13853256366，  关系：公媳，  用工单位：;   "]
["王娜","窗口登记辅助人员-综合岗","女","37028419951210152X","其他","1995-12-10","15898850816","15898850816","山东青岛","未婚","","山东省青岛市黄岛区张家楼","黄岛区珠海街道东风路","本科","否","","","否","","","是","请输入驾龄","1、职业(工种)资格：无，  等级：五级/初级技能，  取得时间：null;  ","1、学历：本科，  学校：商学院，  专业：国际经济与贸易，  毕业时间：2019-06-30;  ","","","1、姓名：王剑君，   联系方式：13863971789，  关系：父女，  用工单位：;   2、姓名：张艳，   联系方式：15863012911，  关系：母女，  用工单位：个体;   "]
["马晓蝶","窗口登记辅助人员-综合岗","女","22018319960729602X","其他","1996-07-29","13520215956","17660956802","吉林德惠","未婚","","吉林省德惠市朝阳乡半拉山村崔老院屯2组","青岛市黄岛区长白山路海港城8-2-2902","本科","否","","","否","","会计初级证","是","6","","1、学历：本科，  学校：长春科技学院，  专业：人力资源管理，  毕业时间：2018-06-20;  ","","","1、姓名：马永胜，   联系方式：13504392541，  关系：父女，  用工单位：无;   2、姓名：宫淑香，   联系方式：15947836461，  关系：母女，  用工单位：无;   "]
["代茹","窗口登记辅助人员-综合岗","女","370284199802246065","其他","1998-02-24","15712713107","15376718427","山东省青岛市黄岛区","未婚","","山东省青岛市黄岛区王台镇雒家76号","山东省青岛市黄岛区王台镇雒家76号","本科","否","","","是","黄岛人力资源有限公司派遣到西海岸新区铁山街道办事处","","是","请输入驾龄","","1、学历：本科，  学校：武汉工程大学邮电与信息工程学院学院经济与管理系，  专业：会计学，  毕业时间：2020-06-30;  ","1、学历：高中，  学校：青岛西海岸新区第一高级中学，  专业：高中，  毕业时间：2016-07-01;  2、学历：初中及以下，  学校：武汉工程大学邮电与信息工程学院 经济与管理系，  专业：会计学，  毕业时间：2020-06-30;  ","1、用工单位：青岛鑫飞泉建设工程有限公司，  职业：会计，  起止时间：2020-07-01至2021-12-31;  2、用工单位：青岛西海岸新区铁山街道办事处，  职业：网格员，  起止时间：2022-01-01至2022-06-29;  ","1、姓名：代方红，   联系方式：15318721877，  关系：父亲，  用工单位：青岛逵首物流有限公司;   2、姓名：王霞，   联系方式：15376718427，  关系：母亲，  用工单位：无;   "]
["张学伟","窗口登记辅助人员-成果岗","男","370284199107062758","群众","1991-07-05","13455212921","15966803507","山东省青岛市","已婚","","山东省青岛市黄岛区泊里镇三合村157号","山东省青岛市李沧区金水路长涧社区","研究生","否","","","是","中国海洋大学","","是","2年","","1、学历：研究生，  学校：长安大学，  专业：测绘工程，  毕业时间：2019-06-21;  ","","","1、姓名：张顺田，   联系方式：15192571201，  关系：父子，  用工单位：;   2、姓名：董运伸，   联系方式：15192571201，  关系：母子，  用工单位：;   3、姓名：王亮芳，   联系方式：15966803507，  关系：夫妻，  用工单位：;   "]
["薛媛","窗口登记辅助人员-综合岗","女","411402198802280541","党员","1988-02-28","15166613008","18562668898","山东青岛","已婚","","411402198802280541","山东省青岛市黄岛区珠江路11号","本科","否","","","否","","","是","请输入驾龄","","1、学历：本科，  学校：解放军信息工程大学，  专业：信息安全，  毕业时间：2009-07-01;  ","","","1、姓名：李志祥，   联系方式：18562668898，  关系：夫妻，  用工单位：;   2、姓名：薛清启，   联系方式：13792900789，  关系：父女，  用工单位：;   3、姓名：张卫华，   联系方式：13695322789，  关系：母女，  用工单位：;   "]
["王梦凡","窗口登记辅助人员-综合岗","女","371102199311052523","党员","1993-11-05","17763396178","15094828122","山东日照","未婚","","山东省日照市东港区涛雒镇三村","山东省日照市东港区涛雒镇三村","本科","否","","","否","","","是","请输入驾龄","","1、学历：本科，  学校：陕西中医药大学人文管理学院，  专业：市场营销，  毕业时间：2016-07-01;  ","","","1、姓名：王均山，   联系方式：15094824628，  关系：父女，  用工单位：;   2、姓名：宋全秀，   联系方式：15094828122，  关系：母女，  用工单位：;   "]
["王春燕","窗口登记辅助人员-文秘岗","女","370284198712316440","群众","1987-12-31","18661782131","18561302969","青岛市黄岛区红石崖镇","已婚","","青岛市黄岛区龙泉王家","青岛市黄岛区庐山路瑞源名嘉汇小区","本科","否","","","否","","","是","7","","1、学历：本科，  学校：青岛科技大学传播学院，  专业：编辑出版学，  毕业时间：2010-06-01;  ","","","1、姓名：王彬，   联系方式：18561302969，  关系：配偶，  用工单位：;   2、姓名：王睿杰，   联系方式：18661782131，  关系：儿子，  用工单位：灵顿中科院幼儿园;   "]
["高静","窗口登记辅助人员-综合岗","女","370284199103113327","群众","1991-03-11","15275261849","徐英杰15053274320","山东省青岛市黄岛区","已婚","","山东省青岛市黄岛区大场镇刘家疃75号","黄岛区迪维花园","本科","否","","","否","","","是","4年","","1、学历：本科，  学校：青岛农业大学人文社科学院，  专业：公共事业管理，  毕业时间：2013-07-01;  ","","1、用工单位：青岛乐士居房地产经纪有限公司，  职业：人事培训，  起止时间：2014-01-04至2018-01-04;  ","1、姓名：徐英杰，   联系方式：15053274320，  关系：夫妻，  用工单位：;   2、姓名：徐誉菲，   联系方式：15053274320，  关系：母女，  用工单位：;   "]
["路婧菡","窗口登记辅助人员-综合岗","女","370305199309126529","群众","1993-09-12","15763940119","18553357563","山东省淄博市临淄区","已婚","","山东省淄博市临淄区华盛园23号楼2单元102","青岛市黄岛区月亮湾2号楼2单元501","本科","否","","","是","山东金正物业管理有限公司青岛分公司","","是","4","","1、学历：本科，  学校：青岛理工大学琴岛学院 艺术系，  专业：艺术设计，  毕业时间：2016-07-01;  ","","","1、姓名：边敬淘，   联系方式：18553357563，  关系：配偶，  用工单位：山东方正房地产开发有限公司;   "]
["王雪莲","窗口登记辅助人员-文秘岗","女","37078419900928432X","群众","1990-09-28","18561979926","18561756591","山东省潍坊市坊子区王家庄街道","未婚","","山东省潍坊市坊子区王家庄街道","山东省青岛市黄岛区薛家岛街道凤凰城","本科","否","","","否","","","是","请输入驾龄","","1、学历：本科，  学校：烟台大学国际教育交流学院，  专业：对外汉语，  毕业时间：2013-06-26;  ","","","1、姓名：王守亮，   联系方式：13011696848，  关系：父亲，  用工单位：;   2、姓名：宿立香，   联系方式：18365662652，  关系：母亲，  用工单位：;   3、姓名：王雪娜，   联系方式：18553528925，  关系：姐姐，  用工单位：;   4、姓名：王凯，   联系方式：18561756591，  关系：哥哥，  用工单位：;   "]
["丁肇翔","窗口登记辅助人员-信息岗","男","370284199110063911","群众","1991-10-06","15265252821","15265295701","山东省青岛市","已婚","","山东省青岛市黄岛区大村镇官家茔村56号","山东省青岛市黄岛区隐珠街道新疆城","本科","否","","","否","","","是","6","","1、学历：本科，  学校：青岛农业大学理学与信息科学学院，  专业：信息与计算科学，  毕业时间：2015-07-01;  ","","","1、姓名：丁源杰，   联系方式：15712724368，  关系：父亲，  用工单位：;   2、姓名：刘瑞新，   联系方式：15265422236，  关系：母亲，  用工单位：;   3、姓名：于杰，   联系方式：15265295701，  关系：妻子，  用工单位：;   "]
["刘佳雯","窗口登记辅助人员-综合岗","女","372925199411162526","其他","1994-11-16","17860709430","18811139910","山东省单县","已婚","","山东省菏泽市单县高韦庄镇大刘庄村","山东省青岛市崂山区东韩社区","研究生","否","","","是","歌尔微电子股份有限公司","","否","请输入驾龄","","1、学历：研究生，  学校：青岛大学自动化学院，  专业：控制工程，  毕业时间：2021-06-30;  ","","","1、姓名：刘德恩，   联系方式：15854007288，  关系：父女，  用工单位：;   2、姓名：黄银鸽，   联系方式：13563855275，  关系：母女，  用工单位：;   3、姓名：杨依伟，   联系方式：18811139910，  关系：配偶，  用工单位：;   "]
["孙宇","窗口登记辅助人员-综合岗","女","370284199803265129","其他","1998-03-26","18669421326","15653210639","山东省青岛市","未婚","","山东省青岛市黄岛区六汪镇胶河经济区西涝庄","山东省青岛市城阳区上马街道北岭西小区","本科","否","","","是","山东思达人才管理有限公司","导游资格证","是","3年","","1、学历：本科，  学校：山东工商学院，工商管理学院，  专业：旅游管理，  毕业时间：2020-06-19;  ","","","1、姓名：孙志才，   联系方式：13780658669，  关系：父女，  用工单位：;   2、姓名：吕复花，   联系方式：13780658669，  关系：母女，  用工单位：;   "]
["王付菊","窗口登记辅助人员-综合岗","女","371323199402027422","群众","1994-02-02","17718593779","15963257072","山东省临沂市","未婚","","山东省沂水县高庄镇拐棒峪村244号","青岛市市北区登州路54号","本科","否","","","否","","","否","请输入驾龄","","1、学历：本科，  学校：外国语学院，  专业：旅游管理，  毕业时间：2016-06-15;  ","","","1、姓名：王恒刚，   联系方式：15264155681，  关系：父女，  用工单位：;   2、姓名：辛立荣，   联系方式：17853983115，  关系：母女，  用工单位：;   3、姓名：王付浩，   联系方式：17853983115，  关系：姐弟，  用工单位：;   "]
["单甜甜","窗口登记辅助人员-综合岗","女","370282199410061122","群众","1994-10-06","15863092707","15954262812","山东省青岛市即墨区龙泉街道","未婚","","山东省青岛市即墨区龙泉镇玉石头村171号","山东省青岛市即墨区龙泉街道钰泉花园","研究生","否","","","否","","","否","请输入驾龄","","1、学历：本科，  学校：山东师范大学化学化工与材料科学学院，  专业：制药工程，  毕业时间：2017-06-30;  ","1、学历：高中，  学校：即墨一中，  专业：无，  毕业时间：2013-06-30;  2、学历：本科，  学校：山东师范大学化学化工与材料科学学院，  专业：制药工程，  毕业时间：2017-06-30;  3、学历：研究生，  学校：中国海洋大学医药学院，  专业：制药工程，  毕业时间：2020-06-30;  ","1、用工单位：北京阜康仁生物制药科技有限公司，  职业：分析研究员，  起止时间：2020-07-14至2021-08-20;  ","1、姓名：单东升，   联系方式：15806508271，  关系：父亲，  用工单位：青岛新艺花生机械有限公司;   2、姓名：范玉香，   联系方式：15954262812，  关系：母亲，  用工单位：务农;   "]
["张喆","窗口登记辅助人员-综合岗","男","370284199011090033","群众","1990-11-09","15092231103","13188993123","山东青岛","已婚","","山东青岛市黄岛区珠海街道办事处大溧水村289号","山东青岛市黄岛区珠海街道办事处大溧水村289号","本科","否","","","否","","","是","4","","1、学历：本科，  学校：北京师范大学，  专业：影视学，  毕业时间：2022-06-29;  ","1、学历：高中，  学校：胶南市第二高级中学，  专业：文科，  毕业时间：2009-06-30;  2、学历：本科，  学校：北京师范大学，  专业：影视学，  毕业时间：2013-06-30;  ","","1、姓名：陈均秀，   联系方式：15166062812，  关系：母亲，  用工单位：黄岛区珠海街道办事处大溧水村;   2、姓名：徐洁，   联系方式：13188993123，  关系：妻子，  用工单位：黄岛区洛可可婚纱摄影工作室;   3、姓名：张奕然，   联系方式：15092231103，  关系：儿子，  用工单位：;   "]
["费红","窗口登记辅助人员-综合岗","女","231181199508163328","群众","1995-08-16","18561757636","15045610572","黑龙江省","未婚","","山东省青岛市黄岛区珠江路106号23号楼2单元2201户","山东省青岛市黄岛区灵山卫街道星光岛杜鹃园221号楼1单元1203","本科","否","","","否","","","是","5","","1、学历：本科，  学校：哈尔滨理工大学 化学与环境工程学院，  专业：材料化学，  毕业时间：2022-06-26;  ","","","1、姓名：费树军，   联系方式：13206939981，  关系：父女，  用工单位：;   2、姓名：刘静波，   联系方式：15045610572，  关系：母女，  用工单位：;   "]
["王祎明","窗口登记辅助人员-综合岗","男","230205199308140613","群众","1993-08-14","13210037741","15615526630","青岛","未婚","","青岛市城阳区正阳路街道","青岛市城阳区铁骑山路80号千禧国际村","本科","否","","","否","","","否","请输入驾龄","","1、学历：本科，  学校：浙江传媒学院，  专业：数字媒体艺术，  毕业时间：2017-06-15;  ","1、学历：高中，  学校：城阳一中，  专业：高中，  毕业时间：2012-06-01;  2、学历：本科，  学校：浙江传媒学院，  专业：数字媒体艺术，  毕业时间：2017-06-15;  ","1、用工单位：青岛捷利建筑工程有限公司，  职业：文员，  起止时间：2016-06-20至2020-06-05;  2、用工单位：东方影都融创有限责任公司，  职业：策划，  起止时间：2020-06-05至2021-10-15;  ","1、姓名：王友，   联系方式：18669808778，  关系：父子，  用工单位：青岛华鹏建工;   2、姓名：陈彦芹，   联系方式：15615526630，  关系：母子，  用工单位：退休;   "]
["毛文凝","窗口登记辅助人员-综合岗","女","370284199803160028","群众","1998-03-16","15963233811","18678975162","山东省青岛市西海岸新区","未婚","","山东省青岛市西海岸新区","青岛市西海岸新区王戈庄佳苑","本科","否","","","否","","","是","请输入驾龄3年","","1、学历：本科，  学校：青岛大学，  专业：思想政治教育，  毕业时间：2022-06-30;  ","1、学历：高中，  学校：黄岛区实验中学，  专业：无，  毕业时间：2022-06-30;  2、学历：本科，  学校：青岛大学，  专业：思想政治教育，  毕业时间：2022-06-30;  ","","1、姓名：毛永刚，   联系方式：18661489039，  关系：父亲，  用工单位：;   2、姓名：王萍，   联系方式：18678975162，  关系：母亲，  用工单位：;   "]
["李洁","窗口登记辅助人员-综合岗","女","37021119910410052X","党员","1991-04-10","18663956919","18669708590","山东省青岛市黄岛区","已婚","2013-06-01","青岛市黄岛区李家泊子村16号","青岛市黄岛区绿岛印象欣苑","本科","否","","","否","","","是","8","","1、学历：本科，  学校：山东大学商学院，  专业：市场营销，  毕业时间：2014-06-30;  ","","1、用工单位：中国平安人寿保险股份有限公司青岛分公司，  职业：人员管理岗，  起止时间：2016-09-27至2022-06-29;  ","1、姓名：李哲，   联系方式：18669708590，  关系：配偶，  用工单位：;   "]
["朱霜","窗口登记辅助人员-综合岗","女","370284199611026721","其他","1996-11-02","17854262064","17863901256","山东青岛","未婚","","山东省青岛市黄岛区灵山卫街道朱戈庄村","山东省青岛市黄岛区扒山小区","本科","否","","","否","","","是","请输入驾龄","","1、学历：本科，  学校：中国石油大学（华东）经济管理学院，  专业：经济学，  毕业时间：2018-06-25;  ","","","1、姓名：朱明科，   联系方式：17863901256，  关系：父亲，  用工单位：;   2、姓名：薛洪美，   联系方式：15954253627，  关系：母亲，  用工单位：;   "]
["刘锐","窗口登记辅助人员-综合岗","女","370284199702280442","党员","1997-02-28","15269295668","18612957679","青岛市黄岛区","未婚","2018-11-24","山东省青岛市黄岛区铁橛山路1635号","山东省青岛市黄岛区银盛泰星海城1期","本科","否","","","否","","","是","一年半","","1、学历：本科，  学校：宝鸡文理学院音乐学院，  专业：音乐学，  毕业时间：2020-07-10;  ","1、学历：高中，  学校：西海岸新区第五中学，  专业：文科，  毕业时间：2015-06-10;  2、学历：高中，  学校：明天中学，  专业：文科，  毕业时间：2016-06-10;  3、学历：本科，  学校：宝鸡文理学院音乐学院，  专业：音乐学，  毕业时间：2022-07-10;  ","1、用工单位：隐珠小学，  职业：教师，  起止时间：2020-09-01至2022-01-01;  ","1、姓名：丁世春，   联系方式：13608972572，  关系：母女，  用工单位：大村中心卫生院;   2、姓名：刘相军，   联系方式：13408972572，  关系：父女，  用工单位：西海岸新区隐珠小学;   "]
["刘傲雪","窗口登记辅助人员-综合岗","女","652201199109021624","群众","1991-09-01","18765216521","13969869486","山东青岛","已婚","","山东青岛西海岸新区戴戈庄社区","山东青岛西海岸新区戴戈庄社区","本科","否","","","否","","","是","1年","","1、学历：本科，  学校：青岛滨海学院，  专业：国际经济与贸易，  毕业时间：2022-07-06;  ","","","1、姓名：杨峰，   联系方式：13969869486，  关系：夫妻，  用工单位：;   "]
["王宏颖","窗口登记辅助人员-综合岗","女","150428199303193981","群众","1993-03-19","15264252653","13864209289","山东青岛","已婚","","山东省青岛市市北区东莞路2号1单元101户山东省青岛市市北区东莞路2号1单元101户","山东省青岛市市北区东莞路2号1单元101户","本科","否","","","否","","","是","请输入驾龄","","1、学历：本科，  学校：山东大学，历史文化学院，  专业：文化产业管理专业，  毕业时间：2016-06-30;  ","","","1、姓名：王钦秀，   联系方式：15947060476，  关系：父女，  用工单位：;   "]
["张慧","窗口登记辅助人员-综合岗","女","370284199710190068","其他","1997-10-19","18253299805","15092207726","山东省青岛市黄岛区","未婚","","山东省青岛市黄岛区大河东村349号","山东省青岛市黄岛区大河东村349号","本科","否","","","否","","","是","不到一年","","1、学历：初中及以下，  学校：湖南女子学院，  专业：sha商务英语，  毕业时间：2020-06-13;  ","1、学历：本科，  学校：湖南女子学院，  专业：商务英语，  毕业时间：2020-06-13;  2、学历：高中，  学校：黄岛区实验中学，  专业：文科，  毕业时间：2016-06-30;  ","1、用工单位：西海岸新区风河小学，  职业：小学英语教师，  起止时间：2020-08-27至2022-06-30;  ","1、姓名：张宗军，   联系方式：15964951718，  关系：父亲，  用工单位：泰和居美食坊;   2、姓名：刘明红，   联系方式：15006584187，  关系：母亲，  用工单位：泰和居美食坊;   "]
["刘娜","窗口登记辅助人员-综合岗","女","130582198809050828","群众","1988-09-04","15231167153","15006585160","河北省沙河市冀庄村","已婚","","河北省沙河市周庄办事处冀庄村107","石家庄市新华区友谊大街天苑小区","本科","否","","","否","","本科","是","请输入驾龄3","","1、学历：本科，  学校：中南林业科技大学外语系，  专业：英语，  毕业时间：2022-06-30;  ","1、学历：高中，  学校：沙河市第二中学，  专业：高中生，  毕业时间：2022-06-30;  2、学历：高中，  学校：衡水第二中学，  专业：高中生，  毕业时间：2022-06-30;  3、学历：本科，  学校：中南林业科技大学，  专业：英语，  毕业时间：2022-06-30;  ","1、用工单位：大自然地板中国有限公司，  职业：总助，  起止时间：2022-06-30至2022-06-30;  2、用工单位：河北亿客隆进出口贸易有限公司，  职业：销售，  起止时间：2022-06-30至2022-06-30;  ","1、姓名：刘罗的，   联系方式：15833493317，  关系：父亲，  用工单位：沙河市冀庄村;   2、姓名：武明飞，   联系方式：15006585160，  关系：夫妻，  用工单位：青岛华冶;   "]
["卢文","窗口登记辅助人员-综合岗","女","370682199606216220","党员","1996-06-21","15668049957","13061221210","山东省烟台市","未婚","2016-03-16","山东省烟台市莱阳市穴坊镇西桃村","山东省青岛市黄岛区隐珠街道天一畔城山水居","本科","否","","","否","","","是","6年","","1、学历：本科，  学校：山东科技大学 土建学院，  专业：建筑环境与能源应用工程，  毕业时间：2018-06-28;  ","1、学历：高中，  学校：莱阳市第一中学，  专业：无，  毕业时间：2014-06-10;  ","1、用工单位：青岛万科，  职业：万物生，  起止时间：2018-07-04至2019-04-26;  2、用工单位：青岛万科，  职业：客户经理，  起止时间：2019-04-26至2021-06-28;  3、用工单位：融创中国，  职业：客户关系管理，  起止时间：2021-06-29至2022-06-03;  ","1、姓名：卢德江，   联系方式：13188760615，  关系：父亲，  用工单位：无;   2、姓名：宋美芳，   联系方式：18663806581，  关系：母亲，  用工单位：无;   "]
{"$rows_left_out":106}
{"sheet":"Sheet1","index":1,"n_rows":111,"n_cols":6,"rows_kept":111,"merged":[[0,0,0,5]]}
["青岛西海岸新区不动产登记中心公开招聘窗口登记辅助人员笔试成绩及进入面试范围人员名单"]
["序号","报考岗位","证件号码","准考证号","笔试成绩","是否进入面试"]
[1,"窗口登记辅助人员-成果岗","370284********5828",202301002,{"$f":"VLOOKUP(D3,[1]笔试成绩统计!$C:$F,4,0)","v":63},"是 "]
[2,"窗口登记辅助人员-成果岗","370724********6608",202301004,{"$f":"VLOOKUP(D4,[1]笔试成绩统计!$C:$F,4,0)","v":55},"是 "]
[3,"窗口登记辅助人员-成果岗","370811********0041",202301003,{"$f":"VLOOKUP(D5,[1]笔试成绩统计!$C:$F,4,0)","v":51},"是 "]
[4,"窗口登记辅助人员-成果岗","370284********2758",202301001,{"$f":"VLOOKUP(D6,[1]笔试成绩统计!$C:$F,4,0)","v":50},"否"]
[5,"窗口登记辅助人员-法律岗","371321********4715",202302005,{"$f":"VLOOKUP(D7,[1]笔试成绩统计!$C:$F,4,0)","v":60},"是 "]
[6,"窗口登记辅助人员-法律岗","370284********4318",202302003,{"$f":"VLOOKUP(D8,[1]笔试成绩统计!$C:$F,4,0)","v":55},"是 "]
[7,"窗口登记辅助人员-法律岗","230502********1520",202302006,{"$f":"VLOOKUP(D9,[1]笔试成绩统计!$C:$F,4,0)","v":55},"是 "]
[8,"窗口登记辅助人员-法律岗","370911********206X",202302001,"缺考"]
[9,"窗口登记辅助人员-法律岗","370283********0043",202302002,"缺考"]
[10,"窗口登记辅助人员-法律岗","370284********043X",202302004,"缺考"]
[11,"窗口登记辅助人员-法律岗","370786********3041",202302007,{"$f":"VLOOKUP(D13,[1]笔试成绩统计!$C:$F,4,0)","v":"缺考"}]
[12,"窗口登记辅助人员-文秘岗","150203********3142",202303003,{"$f":"VLOOKUP(D14,[1]笔试成绩统计!$C:$F,4,0)","v":56},"是 "]
[13,"窗口登记辅助人员-文秘岗","370323********0446",202303001,{"$f":"VLOOKUP(D15,[1]笔试成绩统计!$C:$F,4,0)","v":54},"是 "]
[14,"窗口登记辅助人员-文秘岗","370211********0526",202303004,{"$f":"VLOOKUP(D16,[1]笔试成绩统计!$C:$F,4,0)","v":54},"是 "]
[15,"窗口登记辅助人员-文秘岗","370784********432X",202303002,"缺考"]
[16,"窗口登记辅助人员-信息岗","370284********413X",202304002,{"$f":"VLOOKUP(D18,[1]笔试成绩统计!$C:$F,4,0)","v":61},"是 "]
[17,"窗口登记辅助人员-信息岗","370284********3911",202304001,{"$f":"VLOOKUP(D19,[1]笔试成绩统计!$C:$F,4,0)","v":59},"是 "]
[18,"窗口登记辅助人员-信息岗","370785********3073",202304004,{"$f":"VLOOKUP(D20,[1]笔试成绩统计!$C:$F,4,0)","v":58},"是 "]
[19,"窗口登记辅助人员-信息岗","370284********0431",202304003,"缺考"]
[20,"窗口登记辅助人员-综合岗","370481********0098",202305061,75,"是"]
[21,"窗口登记辅助人员-综合岗","370284********3622",202305080,70,"是"]
[22,"窗口登记辅助人员-综合岗","370211********052X",202305024,68,"是"]
[23,"窗口登记辅助人员-综合岗","370284********5326",202305009,65,"否"]
[24,"窗口登记辅助人员-综合岗","370284********6440",202305005,63,"否"]
[25,"窗口登记辅助人员-综合岗","150428********3981",202305028,60,"否"]
[26,"窗口登记辅助人员-综合岗","370282********2346",202305084,60,"否"]
[27,"窗口登记辅助人员-综合岗","370284********2121",202305052,58,"否"]
[28,"窗口登记辅助人员-综合岗","370284********4140",202305073,58,"否"]
[29,"窗口登记辅助人员-综合岗","370284********4613",202305077,58,"否"]
[30,"窗口登记辅助人员-综合岗","652201********1624",202305027,56,"否"]
[31,"窗口登记辅助人员-综合岗","370284********1226",202305055,56,"否"]
[32,"窗口登记辅助人员-综合岗","370283********6219",202305056,56,"否"]
[33,"窗口登记辅助人员-综合岗","370284********1016",202305058,56,"否"]
[34,"窗口登记辅助人员-综合岗","370202********1145",202305070,56,"否"]
[35,"窗口登记辅助人员-综合岗","370284********0033",202305020,55,"否"]
[36,"窗口登记辅助人员-综合岗","372925********1847",202305038,55,"否"]
[37,"窗口登记辅助人员-综合岗","370284********0421",202305074,55,"否"]
[38,"窗口登记辅助人员-综合岗","371327********5449",202305043,52,"否"]
{"$rows_left_out":71}